error compiling seti on a Sun netra X1 running Debian


log in

Advanced search

Message boards : Number crunching : error compiling seti on a Sun netra X1 running Debian

Author Message
Profile Kermit the Frog
Send message
Joined: 26 Nov 02
Posts: 15
Credit: 603,279
RAC: 0
United Kingdom
Message 6660 - Posted: 11 Jul 2004, 21:42:20 UTC

hi guys, i am getting:

sun:/tmp/seti_boinc# make
(cd client; make all)
make[1]: Entering directory `/tmp/seti_boinc/client'
g++ -g -O2 -DHAVE_CONFIG_H -DTEXT_UI -DNDEBUG -DCLIENT -I.. -I../db -I/tmp/boinc/api -I/tmp/boinc/lib -I/tmp/boinc/image_libs/ -M *.cpp > dependencies
make[1]: Leaving directory `/tmp/seti_boinc/client'
make[1]: Entering directory `/tmp/seti_boinc/client'
g++ main.o -L. -looura -lstdc++ -lnsl -lm -ldl -o setiathome-3.10.sparc64-unknown-linux-gnu -L/tmp/boinc/lib -lboinc
main.o(.text+0x80): In function `print_error(int)':
/tmp/seti_boinc/client/main.cpp:74: undefined reference to `error_string(int)'
main.o(.text+0xa8): In function `print_version()':
/tmp/seti_boinc/client/main.cpp:79: undefined reference to `gmajor_version'
main.o(.text+0xac):/tmp/seti_boinc/client/main.cpp:79: undefined reference to `gminor_version'
main.o(.text+0xb0):/tmp/seti_boinc/client/main.cpp:79: undefined reference to `gmajor_version'
main.o(.text+0xb4):/tmp/seti_boinc/client/main.cpp:79: undefined reference to `gminor_version'
main.o(.text+0x104): In function `main':
/tmp/seti_boinc/client/main.cpp:116: undefined reference to `verbose'
main.o(.text+0x144):/tmp/seti_boinc/client/main.cpp:121: undefined reference to `verbose'
main.o(.text+0x1d8):/tmp/seti_boinc/client/main.cpp:169: undefined reference to `worker()'
main.o(.text+0x300):/tmp/seti_boinc/client/main.cpp:184: undefined reference to `seti_error::print() const'
main.o(.text+0x334):/tmp/seti_boinc/client/main.cpp:180: undefined reference to `checkpoint(unsigned char)'
collect2: ld returned 1 exit status
make[1]: *** [setiathome-3.10.sparc64-unknown-linux-gnu] Error 1
make[1]: Leaving directory `/tmp/seti_boinc/client'
make: *** [all] Error 2
sun:/tmp/seti_boinc#


any one?

Message boards : Number crunching : error compiling seti on a Sun netra X1 running Debian

Copyright © 2014 University of California